Build started at 2026-10-08T12:56:54.498028
Main binary: /usr/bin/python3
Build Options: -Db_lto=true -Dplatform=native -Dbuildtype=release -Ddebug=true -Dexamples= -Denable_drivers=bus/pci,bus/vdev,bus/auxiliary,net/i40e,net/intel/iavf '-Ddisable_apps=*' -Dmax_numa_nodes=1
Python system: Linux
The Meson build system
Version: 1.7.0
Source dir: /root/dpdk
Build dir: /root/dpdk/build
Build type: native build
Project name: DPDK
Project version: 26.07.0
C compiler for the host machine: cc (gcc 14.2.0 "cc (Debian 14.2.0-19) 14.2.0")
C linker for the host machine: cc ld.bfd 2.44
-----------
Detecting archiver via: `gcc-ar --version` -> 0
stdout:
GNU ar (GNU Binutils for Debian) 2.44
Copyright (C) 2025 Free Software Foundation, Inc.
This program is free software; you may redistribute it under the terms of
the GNU General Public License version 3 or (at your option) any later version.
This program has absolutely no warranty.
-----------
C compiler for the build machine: cc (gcc 14.2.0 "cc (Debian 14.2.0-19) 14.2.0")
C linker for the build machine: cc ld.bfd 2.44
-----------
Detecting archiver via: `gcc-ar --version` -> 0
stdout:
GNU ar (GNU Binutils for Debian) 2.44
Copyright (C) 2025 Free Software Foundation, Inc.
This program is free software; you may redistribute it under the terms of
the GNU General Public License version 3 or (at your option) any later version.
This program has absolutely no warranty.
-----------
Build machine cpu family: x86_64
Build machine cpu: x86_64
Host machine cpu family: x86_64
Host machine cpu: x86_64
Target machine cpu family: x86_64
Target machine cpu: x86_64
Message: ## Building in Developer Mode ##
[Errno 21] Is a directory: '/root/dpdk/buildtools/pkg-config'
Unusable script '/root/dpdk/buildtools/pkg-config'
Program pkg-config found: YES (/usr/bin/pkg-config)
Program check-symbols.sh found: YES (/root/dpdk/buildtools/check-symbols.sh)
Program options-ibverbs-static.sh found: YES (/root/dpdk/buildtools/options-ibverbs-static.sh)
Program python3 found: YES (/usr/bin/python3)
Program python3 (elftools) found: YES (/usr/bin/python3) modules: elftools
Running command: /usr/bin/python3 /root/dpdk/buildtools/get-min-meson-version.py
--- stdout ---
0.57.2
--- stderr ---


Message: Minimum Meson required version is 0.57.2
Program cat found: YES (/usr/bin/cat)
Running command: /usr/bin/cat /root/dpdk/ABI_VERSION
--- stdout ---
26.2

--- stderr ---


Using cached compile:
Cached command line:  cc /root/dpdk/build/meson-private/tmpanm67f_v/testfile.c -o /root/dpdk/build/meson-private/tmpanm67f_v/output.obj -c -D_FILE_OFFSET_BITS=64 -O0 -march=native 

Code:
 extern int i;
int i;

Cached compiler stdout:
 
Cached compiler stderr:
 
Compiler for C supports arguments -march=native: YES (cached)
Using cached run result:
Code:
 
        #include<stddef.h>
        #include<stdio.h>
        int main(void) {
            printf("%ld\n", (long)(sizeof(void *)));
            return 0;
        }
Args:
 functools.partial(<bound method CompilerHolder._determine_args of <[CompilerHolder] holds [GnuCCompiler]: <GnuCCompiler: v14.2.0 `cc`>>>, {'args': [], 'dependencies': [], 'include_directories': [], 'prefix': '', 'no_builtin_args': False})
Cached run returncode:
 0
Cached run stdout:
 8

Cached run stderr:
 
Checking for size of "void *" : 8 (cached)
Using cached run result:
Code:
 
        #include<stddef.h>
        #include<stdio.h>
        int main(void) {
            printf("%ld\n", (long)(sizeof(void *)));
            return 0;
        }
Args:
 functools.partial(<bound method CompilerHolder._determine_args of <[CompilerHolder] holds [GnuCCompiler]: <GnuCCompiler: v14.2.0 `cc`>>>, {'args': [], 'dependencies': [], 'include_directories': [], 'prefix': '', 'no_builtin_args': False})
Cached run returncode:
 0
Cached run stdout:
 8

Cached run stderr:
 
Checking for size of "void *" : 8 (cached)
Using cached compile:
Cached command line:  cc /root/dpdk/build/meson-private/tmpmi9aybrb/testfile.c -o /root/dpdk/build/meson-private/tmpmi9aybrb/output.exe -D_FILE_OFFSET_BITS=64 -O0 -Wl,--fatal-warnings -Wl,--undefined-version 

Code:
 int main(void) { return 0; }

Cached compiler stdout:
 
Cached compiler stderr:
 
Compiler for C supports link arguments -Wl,--undefined-version: YES (cached)
Running compile:
Working directory:  /root/dpdk/build/meson-private/tmpzgh2pr2t
Code:
int main(void) { return 0; }

-----------
Command line: `cc /root/dpdk/build/meson-private/tmpzgh2pr2t/testfile.c -o /root/dpdk/build/meson-private/tmpzgh2pr2t/output.exe -D_FILE_OFFSET_BITS=64 -O0 -lm -Wl,--allow-shlib-undefined` -> 0
Library m found: YES
Using cached compile:
Cached command line:  cc /root/dpdk/build/meson-private/tmp5i8y6uco/testfile.c -o /root/dpdk/build/meson-private/tmp5i8y6uco/output.exe -D_FILE_OFFSET_BITS=64 -O0 -std=c11 -lm 

Code:
 int main(void) { return 0; }
Cached compiler stdout:
 
Cached compiler stderr:
 
Running compile:
Working directory:  /root/dpdk/build/meson-private/tmpeiiilcng
Code:
int main(void) { return 0; }

-----------
Command line: `cc /root/dpdk/build/meson-private/tmpeiiilcng/testfile.c -o /root/dpdk/build/meson-private/tmpeiiilcng/output.exe -D_FILE_OFFSET_BITS=64 -O0 -lnuma -Wl,--allow-shlib-undefined` -> 0
Library numa found: YES
Using cached compile:
Cached command line:  cc /root/dpdk/build/meson-private/tmpj1kdct5b/testfile.c -E -P -D_FILE_OFFSET_BITS=64 -P -O0 -std=c11 

Code:
 
        #ifdef __has_include
         #if !__has_include("numaif.h")
          #error "Header 'numaif.h' could not be found"
         #endif
        #else
         #include <numaif.h>
        #endif
Cached compiler stdout:
 
Cached compiler stderr:
 
Has header "numaif.h" : YES (cached)
Using cached compile:
Cached command line:  cc /root/dpdk/build/meson-private/tmp9zaa0jkh/testfile.c -o /root/dpdk/build/meson-private/tmp9zaa0jkh/output.exe -D_FILE_OFFSET_BITS=64 -O0 -std=c11 -lnuma 

Code:
 int main(void) { return 0; }
Cached compiler stdout:
 
Cached compiler stderr:
 
Running compile:
Working directory:  /root/dpdk/build/meson-private/tmposqilx2f
Code:
int main(void) { return 0; }

-----------
Command line: `cc /root/dpdk/build/meson-private/tmposqilx2f/testfile.c -o /root/dpdk/build/meson-private/tmposqilx2f/output.exe -D_FILE_OFFSET_BITS=64 -O0 -lfdt -Wl,--allow-shlib-undefined` -> 1
stderr:
/usr/bin/ld: cannot find -lfdt: No such file or directory
collect2: error: ld returned 1 exit status
-----------
Using cached run result:
Code:
 
        #include<stddef.h>
        #include<stdio.h>
        int main(void) {
            printf("%ld\n", (long)(sizeof(void *)));
            return 0;
        }
Args:
 []
Cached run returncode:
 0
Cached run stdout:
 8

Cached run stderr:
 
Running compile:
Working directory:  /root/dpdk/build/meson-private/tmp5l0pccsz
Code:

-----------
Command line: `cc /root/dpdk/build/meson-private/tmp5l0pccsz/testfile.c -o /root/dpdk/build/meson-private/tmp5l0pccsz/output.obj -c -D_FILE_OFFSET_BITS=64 -O0 --print-search-dirs` -> 0
stdout:
install: /usr/lib/gcc/x86_64-linux-gnu/14/
programs: =/usr/libexec/gcc/x86_64-linux-gnu/14/:/usr/libexec/gcc/x86_64-linux-gnu/14/:/usr/libexec/gcc/x86_64-linux-gnu/:/usr/lib/gcc/x86_64-linux-gnu/14/:/usr/lib/gcc/x86_64-linux-gnu/:/usr/lib/gcc/x86_64-linux-gnu/14/../../../../x86_64-linux-gnu/bin/x86_64-linux-gnu/14/:/usr/lib/gcc/x86_64-linux-gnu/14/../../../../x86_64-linux-gnu/bin/x86_64-linux-gnu/:/usr/lib/gcc/x86_64-linux-gnu/14/../../../../x86_64-linux-gnu/bin/
libraries: =/usr/lib/gcc/x86_64-linux-gnu/14/:/usr/lib/gcc/x86_64-linux-gnu/14/../../../../x86_64-linux-gnu/lib/x86_64-linux-gnu/14/:/usr/lib/gcc/x86_64-linux-gnu/14/../../../../x86_64-linux-gnu/lib/x86_64-linux-gnu/:/usr/lib/gcc/x86_64-linux-gnu/14/../../../../x86_64-linux-gnu/lib/../lib/:/usr/lib/gcc/x86_64-linux-gnu/14/../../../x86_64-linux-gnu/14/:/usr/lib/gcc/x86_64-linux-gnu/14/../../../x86_64-linux-gnu/:/usr/lib/gcc/x86_64-linux-gnu/14/../../../../lib/:/lib/x86_64-linux-gnu/14/:/lib/x86_64-linux-gnu/:/lib/../lib/:/usr/lib/x86_64-linux-gnu/14/:/usr/lib/x86_64-linux-gnu/:/usr/lib/../lib/:/usr/lib/gcc/x86_64-linux-gnu/14/../../../../x86_64-linux-gnu/lib/:/usr/lib/gcc/x86_64-linux-gnu/14/../../../:/lib/:/usr/lib/
-----------
Library fdt found: NO
Running compile:
Working directory:  /root/dpdk/build/meson-private/tmpd4m4wpx5
Code:
int main(void) { return 0; }

-----------
Command line: `cc /root/dpdk/build/meson-private/tmpd4m4wpx5/testfile.c -o /root/dpdk/build/meson-private/tmpd4m4wpx5/output.exe -D_FILE_OFFSET_BITS=64 -O0 -lexecinfo -Wl,--allow-shlib-undefined` -> 1
stderr:
/usr/bin/ld: cannot find -lexecinfo: No such file or directory
collect2: error: ld returned 1 exit status
-----------
Library execinfo found: NO
Using cached compile:
Cached command line:  cc /root/dpdk/build/meson-private/tmpkyvdrg7b/testfile.c -E -P -D_FILE_OFFSET_BITS=64 -P -O0 -std=c11 

Code:
 
        #ifdef __has_include
         #if !__has_include("execinfo.h")
          #error "Header 'execinfo.h' could not be found"
         #endif
        #else
         #include <execinfo.h>
        #endif
Cached compiler stdout:
 
Cached compiler stderr:
 
Has header "execinfo.h" : YES (cached)
Pkg-config binary missing from cross or native file, or env var undefined.
Trying a default Pkg-config fallback at pkg-config
Found pkg-config: YES (/usr/bin/pkg-config) 1.8.1
Determining dependency 'libarchive' with pkg-config executable '/usr/bin/pkg-config'
env[PKG_CONFIG_PATH]: 
env[PKG_CONFIG]: /usr/bin/pkg-config
-----------
Called: `/usr/bin/pkg-config --modversion libarchive` -> 1
stderr:
Package libarchive was not found in the pkg-config search path.
Perhaps you should add the directory containing `libarchive.pc'
to the PKG_CONFIG_PATH environment variable
Package 'libarchive', required by 'virtual:world', not found
-----------
Run-time dependency libarchive found: NO (tried pkgconfig)
Determining dependency 'libbsd' with pkg-config executable '/usr/bin/pkg-config'
env[PKG_CONFIG_PATH]: 
env[PKG_CONFIG]: /usr/bin/pkg-config
-----------
Called: `/usr/bin/pkg-config --modversion libbsd` -> 1
stderr:
Package libbsd was not found in the pkg-config search path.
Perhaps you should add the directory containing `libbsd.pc'
to the PKG_CONFIG_PATH environment variable
Package 'libbsd', required by 'virtual:world', not found
-----------
Run-time dependency libbsd found: NO (tried pkgconfig)
Determining dependency 'jansson' with pkg-config executable '/usr/bin/pkg-config'
env[PKG_CONFIG_PATH]: 
env[PKG_CONFIG]: /usr/bin/pkg-config
-----------
Called: `/usr/bin/pkg-config --modversion jansson` -> 1
stderr:
Package jansson was not found in the pkg-config search path.
Perhaps you should add the directory containing `jansson.pc'
to the PKG_CONFIG_PATH environment variable
Package 'jansson', required by 'virtual:world', not found
-----------
Run-time dependency jansson found: NO (tried pkgconfig)
Determining dependency 'openssl' with pkg-config executable '/usr/bin/pkg-config'
env[PKG_CONFIG_PATH]: 
env[PKG_CONFIG]: /usr/bin/pkg-config
-----------
Called: `/usr/bin/pkg-config --modversion openssl` -> 1
stderr:
Package openssl was not found in the pkg-config search path.
Perhaps you should add the directory containing `openssl.pc'
to the PKG_CONFIG_PATH environment variable
Package 'openssl', required by 'virtual:world', not found
-----------
Run-time dependency openssl found: NO (tried pkgconfig)
Dependency libpcap found: YES 1.10.5 (cached)
Using cached compile:
Cached command line:  cc -I/usr/include/dbus-1.0 -I/usr/lib/x86_64-linux-gnu/dbus-1.0/include /root/dpdk/build/meson-private/tmpb76rmtgg/testfile.c -E -P -D_FILE_OFFSET_BITS=64 -P -O0 -std=c11 

Code:
 
        #ifdef __has_include
         #if !__has_include("pcap.h")
          #error "Header 'pcap.h' could not be found"
         #endif
        #else
         #include <pcap.h>
        #endif
Cached compiler stdout:
 
Cached compiler stderr:
 
Has header "pcap.h" with dependency libpcap: YES (cached)
Using cached compile:
Cached command line:  cc -I/usr/include/dbus-1.0 -I/usr/lib/x86_64-linux-gnu/dbus-1.0/include /root/dpdk/build/meson-private/tmpu5qogvfp/testfile.c -o /root/dpdk/build/meson-private/tmpu5qogvfp/output.exe -D_FILE_OFFSET_BITS=64 -O0 -std=c11 /usr/lib/x86_64-linux-gnu/libpcap.so 

Code:
 int main(void) { return 0; }
Cached compiler stdout:
 
Cached compiler stderr:
 
Using cached compile:
Cached command line:  cc /root/dpdk/build/meson-private/tmpqh3c31_q/testfile.c -o /root/dpdk/build/meson-private/tmpqh3c31_q/output.obj -c -D_FILE_OFFSET_BITS=64 -O0 -Wvla 

Code:
 extern int i;
int i;

Cached compiler stdout:
 
Cached compiler stderr:
 
Compiler for C supports arguments -Wvla: YES (cached)
Using cached compile:
Cached command line:  cc /root/dpdk/build/meson-private/tmpy952rqlc/testfile.c -o /root/dpdk/build/meson-private/tmpy952rqlc/output.obj -c -D_FILE_OFFSET_BITS=64 -O0 -Wshadow -Wno-shadow 

Code:
 extern int i;
int i;

Cached compiler stdout:
 
Cached compiler stderr:
 
Compiler for C supports arguments -Wno-shadow: YES (cached)
Using cached compile:
Cached command line:  cc /root/dpdk/build/meson-private/tmpdbjtk0g1/testfile.c -o /root/dpdk/build/meson-private/tmpdbjtk0g1/output.obj -c -D_FILE_OFFSET_BITS=64 -O0 -Wcomma -Wno-comma 

Code:
 extern int i;
int i;

Cached compiler stdout:
 
Cached compiler stderr:
 cc: error: unrecognized command-line option '-Wcomma'; did you mean '-Wcomment'?

Compiler for C supports arguments -Wno-comma: NO (cached)
Using cached compile:
Cached command line:  cc /root/dpdk/build/meson-private/tmp78dr4e08/testfile.c -o /root/dpdk/build/meson-private/tmp78dr4e08/output.obj -c -D_FILE_OFFSET_BITS=64 -O0 -Wcast-qual 

Code:
 extern int i;
int i;

Cached compiler stdout:
 
Cached compiler stderr:
 
Compiler for C supports arguments -Wcast-qual: YES (cached)
Using cached compile:
Cached command line:  cc /root/dpdk/build/meson-private/tmphcp99437/testfile.c -o /root/dpdk/build/meson-private/tmphcp99437/output.obj -c -D_FILE_OFFSET_BITS=64 -O0 -Wcomma 

Code:
 extern int i;
int i;

Cached compiler stdout:
 
Cached compiler stderr:
 cc: error: unrecognized command-line option '-Wcomma'; did you mean '-Wcomment'?

Compiler for C supports arguments -Wcomma: NO (cached)
Using cached compile:
Cached command line:  cc /root/dpdk/build/meson-private/tmpk2u6qt52/testfile.c -o /root/dpdk/build/meson-private/tmpk2u6qt52/output.obj -c -D_FILE_OFFSET_BITS=64 -O0 -Wdeprecated 

Code:
 extern int i;
int i;

Cached compiler stdout:
 
Cached compiler stderr:
 
Compiler for C supports arguments -Wdeprecated: YES (cached)
Using cached compile:
Cached command line:  cc /root/dpdk/build/meson-private/tmporn0d4np/testfile.c -o /root/dpdk/build/meson-private/tmporn0d4np/output.obj -c -D_FILE_OFFSET_BITS=64 -O0 -Wformat 

Code:
 extern int i;
int i;

Cached compiler stdout:
 
Cached compiler stderr:
 
Compiler for C supports arguments -Wformat: YES (cached)
Using cached compile:
Cached command line:  cc /root/dpdk/build/meson-private/tmp6tbt_vhx/testfile.c -o /root/dpdk/build/meson-private/tmp6tbt_vhx/output.obj -c -D_FILE_OFFSET_BITS=64 -O0 -Wformat-nonliteral 

Code:
 extern int i;
int i;

Cached compiler stdout:
 
Cached compiler stderr:
 cc1: warning: '-Wformat-nonliteral' ignored without '-Wformat' [-Wformat-nonliteral]

Compiler for C supports arguments -Wformat-nonliteral: YES (cached)
Using cached compile:
Cached command line:  cc /root/dpdk/build/meson-private/tmpnbrqd_ni/testfile.c -o /root/dpdk/build/meson-private/tmpnbrqd_ni/output.obj -c -D_FILE_OFFSET_BITS=64 -O0 -Wformat-security 

Code:
 extern int i;
int i;

Cached compiler stdout:
 
Cached compiler stderr:
 cc1: warning: '-Wformat-security' ignored without '-Wformat' [-Wformat-security]

Compiler for C supports arguments -Wformat-security: YES (cached)
Using cached compile:
Cached command line:  cc /root/dpdk/build/meson-private/tmp6auftlns/testfile.c -o /root/dpdk/build/meson-private/tmp6auftlns/output.obj -c -D_FILE_OFFSET_BITS=64 -O0 -Wmissing-declarations 

Code:
 extern int i;
int i;

Cached compiler stdout:
 
Cached compiler stderr:
 
Compiler for C supports arguments -Wmissing-declarations: YES (cached)
Using cached compile:
Cached command line:  cc /root/dpdk/build/meson-private/tmppyy_woi6/testfile.c -o /root/dpdk/build/meson-private/tmppyy_woi6/output.obj -c -D_FILE_OFFSET_BITS=64 -O0 -Wmissing-prototypes 

Code:
 extern int i;
int i;

Cached compiler stdout:
 
Cached compiler stderr:
 
Compiler for C supports arguments -Wmissing-prototypes: YES (cached)
Using cached compile:
Cached command line:  cc /root/dpdk/build/meson-private/tmpemwjao2t/testfile.c -o /root/dpdk/build/meson-private/tmpemwjao2t/output.obj -c -D_FILE_OFFSET_BITS=64 -O0 -Wnested-externs 

Code:
 extern int i;
int i;

Cached compiler stdout:
 
Cached compiler stderr:
 
Compiler for C supports arguments -Wnested-externs: YES (cached)
Using cached compile:
Cached command line:  cc /root/dpdk/build/meson-private/tmp7iha22dc/testfile.c -o /root/dpdk/build/meson-private/tmp7iha22dc/output.obj -c -D_FILE_OFFSET_BITS=64 -O0 -Wold-style-definition 

Code:
 extern int i;
int i;

Cached compiler stdout:
 
Cached compiler stderr:
 
Compiler for C supports arguments -Wold-style-definition: YES (cached)
Using cached compile:
Cached command line:  cc /root/dpdk/build/meson-private/tmpp5g0gtm0/testfile.c -o /root/dpdk/build/meson-private/tmpp5g0gtm0/output.obj -c -D_FILE_OFFSET_BITS=64 -O0 -Wpointer-arith 

Code:
 extern int i;
int i;

Cached compiler stdout:
 
Cached compiler stderr:
 
Compiler for C supports arguments -Wpointer-arith: YES (cached)
Using cached compile:
Cached command line:  cc /root/dpdk/build/meson-private/tmpdje1mrkp/testfile.c -o /root/dpdk/build/meson-private/tmpdje1mrkp/output.obj -c -D_FILE_OFFSET_BITS=64 -O0 -Wshadow 

Code:
 extern int i;
int i;

Cached compiler stdout:
 
Cached compiler stderr:
 
Compiler for C supports arguments -Wshadow: YES (cached)
Using cached compile:
Cached command line:  cc /root/dpdk/build/meson-private/tmphkjrqyux/testfile.c -o /root/dpdk/build/meson-private/tmphkjrqyux/output.obj -c -D_FILE_OFFSET_BITS=64 -O0 -Wsign-compare 

Code:
 extern int i;
int i;

Cached compiler stdout:
 
Cached compiler stderr:
 
Compiler for C supports arguments -Wsign-compare: YES (cached)
Using cached compile:
Cached command line:  cc /root/dpdk/build/meson-private/tmpi_5ecpj2/testfile.c -o /root/dpdk/build/meson-private/tmpi_5ecpj2/output.obj -c -D_FILE_OFFSET_BITS=64 -O0 -Wstrict-prototypes 

Code:
 extern int i;
int i;

Cached compiler stdout:
 
Cached compiler stderr:
 
Compiler for C supports arguments -Wstrict-prototypes: YES (cached)
Using cached compile:
Cached command line:  cc /root/dpdk/build/meson-private/tmpk801xnfr/testfile.c -o /root/dpdk/build/meson-private/tmpk801xnfr/output.obj -c -D_FILE_OFFSET_BITS=64 -O0 -Wundef 

Code:
 extern int i;
int i;

Cached compiler stdout:
 
Cached compiler stderr:
 
Compiler for C supports arguments -Wundef: YES (cached)
Using cached compile:
Cached command line:  cc /root/dpdk/build/meson-private/tmpkat2yx92/testfile.c -o /root/dpdk/build/meson-private/tmpkat2yx92/output.obj -c -D_FILE_OFFSET_BITS=64 -O0 -Wwrite-strings 

Code:
 extern int i;
int i;

Cached compiler stdout:
 
Cached compiler stderr:
 
Compiler for C supports arguments -Wwrite-strings: YES (cached)
Using cached compile:
Cached command line:  cc /root/dpdk/build/meson-private/tmph1a3v840/testfile.c -o /root/dpdk/build/meson-private/tmph1a3v840/output.obj -c -D_FILE_OFFSET_BITS=64 -O0 -Wpacked-not-aligned -Wno-packed-not-aligned 

Code:
 extern int i;
int i;

Cached compiler stdout:
 
Cached compiler stderr:
 
Compiler for C supports arguments -Wno-packed-not-aligned: YES (cached)
Using cached compile:
Cached command line:  cc /root/dpdk/build/meson-private/tmppts11rix/testfile.c -o /root/dpdk/build/meson-private/tmppts11rix/output.obj -c -D_FILE_OFFSET_BITS=64 -O0 -Wmissing-field-initializers -Wno-missing-field-initializers 

Code:
 extern int i;
int i;

Cached compiler stdout:
 
Cached compiler stderr:
 
Compiler for C supports arguments -Wno-missing-field-initializers: YES (cached)
Using cached compile:
Cached command line:  cc /root/dpdk/build/meson-private/tmppg9qkvop/testfile.c -o /root/dpdk/build/meson-private/tmppg9qkvop/output.obj -c -D_FILE_OFFSET_BITS=64 -O0 -fzero-init-padding-bits=all 

Code:
 extern int i;
int i;

Cached compiler stdout:
 
Cached compiler stderr:
 cc: error: unrecognized command-line option '-fzero-init-padding-bits=all'

Compiler for C supports arguments -fzero-init-padding-bits=all: NO (cached)
Using cached compile:
Cached command line:  cc /tmp/tmpgzk_xnsq/testfile.c -E -P -D_FILE_OFFSET_BITS=64 -P -O0 -std=c11 -march=native 

Code:
 
        
        #ifndef __AVX2__
        # define __AVX2__ "MESON_GET_DEFINE_UNDEFINED_SENTINEL"
        #endif
        "MESON_GET_DEFINE_DELIMITER_START"
__AVX2__
"MESON_GET_DEFINE_DELIMITER_END"
Cached compiler stdout:
         "MESON_GET_DEFINE_DELIMITER_START"
"MESON_GET_DEFINE_UNDEFINED_SENTINEL"
"MESON_GET_DEFINE_DELIMITER_END"

Cached compiler stderr:
 
Fetching value of define "__AVX2__" : (undefined) (cached)
Using cached compile:
Cached command line:  cc /tmp/tmpbl9v7og1/testfile.c -E -P -D_FILE_OFFSET_BITS=64 -P -O0 -std=c11 -march=native 

Code:
 
        
        #ifndef __znver1__
        # define __znver1__ "MESON_GET_DEFINE_UNDEFINED_SENTINEL"
        #endif
        "MESON_GET_DEFINE_DELIMITER_START"
__znver1__
"MESON_GET_DEFINE_DELIMITER_END"
Cached compiler stdout:
         "MESON_GET_DEFINE_DELIMITER_START"
"MESON_GET_DEFINE_UNDEFINED_SENTINEL"
"MESON_GET_DEFINE_DELIMITER_END"

Cached compiler stderr:
 
Fetching value of define "__znver1__" : (undefined) (cached)
Using cached compile:
Cached command line:  cc /tmp/tmpi575025t/testfile.c -E -P -D_FILE_OFFSET_BITS=64 -P -O0 -std=c11 -march=native 

Code:
 
        
        #ifndef __znver2__
        # define __znver2__ "MESON_GET_DEFINE_UNDEFINED_SENTINEL"
        #endif
        "MESON_GET_DEFINE_DELIMITER_START"
__znver2__
"MESON_GET_DEFINE_DELIMITER_END"
Cached compiler stdout:
         "MESON_GET_DEFINE_DELIMITER_START"
"MESON_GET_DEFINE_UNDEFINED_SENTINEL"
"MESON_GET_DEFINE_DELIMITER_END"

Cached compiler stderr:
 
Fetching value of define "__znver2__" : (undefined) (cached)
Using cached compile:
Cached command line:  cc /tmp/tmp_5_72lfh/testfile.c -E -P -D_FILE_OFFSET_BITS=64 -P -O0 -std=c11 -march=native 

Code:
 
        
        #ifndef __znver3__
        # define __znver3__ "MESON_GET_DEFINE_UNDEFINED_SENTINEL"
        #endif
        "MESON_GET_DEFINE_DELIMITER_START"
__znver3__
"MESON_GET_DEFINE_DELIMITER_END"
Cached compiler stdout:
         "MESON_GET_DEFINE_DELIMITER_START"
"MESON_GET_DEFINE_UNDEFINED_SENTINEL"
"MESON_GET_DEFINE_DELIMITER_END"

Cached compiler stderr:
 
Fetching value of define "__znver3__" : (undefined) (cached)
Using cached compile:
Cached command line:  cc /tmp/tmpbtuxe7_t/testfile.c -E -P -D_FILE_OFFSET_BITS=64 -P -O0 -std=c11 -march=native 

Code:
 
        
        #ifndef __znver4__
        # define __znver4__ "MESON_GET_DEFINE_UNDEFINED_SENTINEL"
        #endif
        "MESON_GET_DEFINE_DELIMITER_START"
__znver4__
"MESON_GET_DEFINE_DELIMITER_END"
Cached compiler stdout:
         "MESON_GET_DEFINE_DELIMITER_START"
"MESON_GET_DEFINE_UNDEFINED_SENTINEL"
"MESON_GET_DEFINE_DELIMITER_END"

Cached compiler stderr:
 
Fetching value of define "__znver4__" : (undefined) (cached)
Using cached compile:
Cached command line:  cc /tmp/tmpnu6scqaw/testfile.c -E -P -D_FILE_OFFSET_BITS=64 -P -O0 -std=c11 -march=native 

Code:
 
        
        #ifndef __znver5__
        # define __znver5__ "MESON_GET_DEFINE_UNDEFINED_SENTINEL"
        #endif
        "MESON_GET_DEFINE_DELIMITER_START"
__znver5__
"MESON_GET_DEFINE_DELIMITER_END"
Cached compiler stdout:
         "MESON_GET_DEFINE_DELIMITER_START"
"MESON_GET_DEFINE_UNDEFINED_SENTINEL"
"MESON_GET_DEFINE_DELIMITER_END"

Cached compiler stderr:
 
Fetching value of define "__znver5__" : (undefined) (cached)
Program objdump found: YES (/usr/bin/objdump)
Running command: /usr/bin/python3 /root/dpdk/config/x86/binutils-avx512-check.py /usr/bin/objdump cc
--- stdout ---

--- stderr ---


Using cached compile:
Cached command line:  cc /root/dpdk/build/meson-private/tmps24zjhcc/testfile.c -o /root/dpdk/build/meson-private/tmps24zjhcc/output.obj -c -D_FILE_OFFSET_BITS=64 -O0 -march=x86-64-v4 

Code:
 extern int i;
int i;

Cached compiler stdout:
 
Cached compiler stderr:
 
Compiler for C supports arguments -march=x86-64-v4: YES (cached)
Using cached compile:
Cached command line:  cc /tmp/tmpjexe7fc3/testfile.c -E -P -D_FILE_OFFSET_BITS=64 -P -O0 -std=c11 -march=native -march=x86-64-v4 

Code:
 
        
        #ifndef __AVX512F__
        # define __AVX512F__ "MESON_GET_DEFINE_UNDEFINED_SENTINEL"
        #endif
        "MESON_GET_DEFINE_DELIMITER_START"
__AVX512F__
"MESON_GET_DEFINE_DELIMITER_END"
Cached compiler stdout:
         "MESON_GET_DEFINE_DELIMITER_START"
1
"MESON_GET_DEFINE_DELIMITER_END"

Cached compiler stderr:
 
Fetching value of define "__AVX512F__" : 1 (cached)
Using cached compile:
Cached command line:  cc /root/dpdk/build/meson-private/tmps24zjhcc/testfile.c -o /root/dpdk/build/meson-private/tmps24zjhcc/output.obj -c -D_FILE_OFFSET_BITS=64 -O0 -march=x86-64-v4 

Code:
 extern int i;
int i;

Cached compiler stdout:
 
Cached compiler stderr:
 
Compiler for C supports arguments -march=x86-64-v4: YES (cached)
Using cached compile:
Cached command line:  cc /root/dpdk/build/meson-private/tmpcenuiery/testfile.c -o /root/dpdk/build/meson-private/tmpcenuiery/output.obj -c -D_FILE_OFFSET_BITS=64 -O0 -std=c11 -march=x86-64-v4 

Code:
 #include <immintrin.h>
    void test(__m512i zmm){
        __m256i ymm = _mm512_extracti64x4_epi64(zmm, 0);}
Cached compiler stdout:
 
Cached compiler stderr:
 
Checking if "AVX512 checking" compiles: YES (cached)
Using cached compile:
Cached command line:  cc /tmp/tmprjs6ruji/testfile.c -E -P -D_FILE_OFFSET_BITS=64 -P -O0 -std=c11 -march=native 

Code:
 
        
        #ifndef __AVX512F__
        # define __AVX512F__ "MESON_GET_DEFINE_UNDEFINED_SENTINEL"
        #endif
        "MESON_GET_DEFINE_DELIMITER_START"
__AVX512F__
"MESON_GET_DEFINE_DELIMITER_END"
Cached compiler stdout:
         "MESON_GET_DEFINE_DELIMITER_START"
"MESON_GET_DEFINE_UNDEFINED_SENTINEL"
"MESON_GET_DEFINE_DELIMITER_END"

Cached compiler stderr:
 
Fetching value of define "__AVX512F__" : (undefined) (cached)
Using cached compile:
Cached command line:  cc /root/dpdk/build/meson-private/tmpdfhlg6i9/testfile.c -o /root/dpdk/build/meson-private/tmpdfhlg6i9/output.obj -c -D_FILE_OFFSET_BITS=64 -O0 -Woverriding-option -Wno-overriding-option 

Code:
 extern int i;
int i;

Cached compiler stdout:
 
Cached compiler stderr:
 cc: error: unrecognized command-line option '-Woverriding-option'

Compiler for C supports arguments -Wno-overriding-option: NO (cached)
Message: Extra C flags needed for AVX2 output: [-mavx2]
Message: Extra C flags needed for AVX512 output: [-march=x86-64-v4]
Using cached compile:
Cached command line:  cc /tmp/tmpwpn2uyx2/testfile.c -E -P -D_FILE_OFFSET_BITS=64 -P -O0 -std=c11 -march=native 

Code:
 
        
        #ifndef __SSE4_2__
        # define __SSE4_2__ "MESON_GET_DEFINE_UNDEFINED_SENTINEL"
        #endif
        "MESON_GET_DEFINE_DELIMITER_START"
__SSE4_2__
"MESON_GET_DEFINE_DELIMITER_END"
Cached compiler stdout:
         "MESON_GET_DEFINE_DELIMITER_START"
1
"MESON_GET_DEFINE_DELIMITER_END"

Cached compiler stderr:
 
Fetching value of define "__SSE4_2__" : 1 (cached)
Using cached compile:
Cached command line:  cc /tmp/tmp4jcpjk52/testfile.c -E -P -D_FILE_OFFSET_BITS=64 -P -O0 -std=c11 -march=native -mrtm 

Code:
 
        
        #ifndef __AES__
        # define __AES__ "MESON_GET_DEFINE_UNDEFINED_SENTINEL"
        #endif
        "MESON_GET_DEFINE_DELIMITER_START"
__AES__
"MESON_GET_DEFINE_DELIMITER_END"
Cached compiler stdout:
         "MESON_GET_DEFINE_DELIMITER_START"
1
"MESON_GET_DEFINE_DELIMITER_END"

Cached compiler stderr:
 
Fetching value of define "__AES__" : 1 (cached)
Using cached compile:
Cached command line:  cc /tmp/tmpcxf22tmz/testfile.c -E -P -D_FILE_OFFSET_BITS=64 -P -O0 -std=c11 -march=native -mrtm 

Code:
 
        
        #ifndef __AVX__
        # define __AVX__ "MESON_GET_DEFINE_UNDEFINED_SENTINEL"
        #endif
        "MESON_GET_DEFINE_DELIMITER_START"
__AVX__
"MESON_GET_DEFINE_DELIMITER_END"
Cached compiler stdout:
         "MESON_GET_DEFINE_DELIMITER_START"
1
"MESON_GET_DEFINE_DELIMITER_END"

Cached compiler stderr:
 
Fetching value of define "__AVX__" : 1 (cached)
Using cached compile:
Cached command line:  cc /tmp/tmpjy5o28gr/testfile.c -E -P -D_FILE_OFFSET_BITS=64 -P -O0 -std=c11 -march=native -mrtm 

Code:
 
        
        #ifndef __AVX2__
        # define __AVX2__ "MESON_GET_DEFINE_UNDEFINED_SENTINEL"
        #endif
        "MESON_GET_DEFINE_DELIMITER_START"
__AVX2__
"MESON_GET_DEFINE_DELIMITER_END"
Cached compiler stdout:
         "MESON_GET_DEFINE_DELIMITER_START"
"MESON_GET_DEFINE_UNDEFINED_SENTINEL"
"MESON_GET_DEFINE_DELIMITER_END"

Cached compiler stderr:
 
Fetching value of define "__AVX2__" : (undefined) (cached)
Using cached compile:
Cached command line:  cc /tmp/tmp7r6k7sh2/testfile.c -E -P -D_FILE_OFFSET_BITS=64 -P -O0 -std=c11 -march=native -mrtm 

Code:
 
        
        #ifndef __AVX512BW__
        # define __AVX512BW__ "MESON_GET_DEFINE_UNDEFINED_SENTINEL"
        #endif
        "MESON_GET_DEFINE_DELIMITER_START"
__AVX512BW__
"MESON_GET_DEFINE_DELIMITER_END"
Cached compiler stdout:
         "MESON_GET_DEFINE_DELIMITER_START"
"MESON_GET_DEFINE_UNDEFINED_SENTINEL"
"MESON_GET_DEFINE_DELIMITER_END"

Cached compiler stderr:
 
Fetching value of define "__AVX512BW__" : (undefined) (cached)
Using cached compile:
Cached command line:  cc /tmp/tmpxe1l6shd/testfile.c -E -P -D_FILE_OFFSET_BITS=64 -P -O0 -std=c11 -march=native -mrtm 

Code:
 
        
        #ifndef __AVX512CD__
        # define __AVX512CD__ "MESON_GET_DEFINE_UNDEFINED_SENTINEL"
        #endif
        "MESON_GET_DEFINE_DELIMITER_START"
__AVX512CD__
"MESON_GET_DEFINE_DELIMITER_END"
Cached compiler stdout:
         "MESON_GET_DEFINE_DELIMITER_START"
"MESON_GET_DEFINE_UNDEFINED_SENTINEL"
"MESON_GET_DEFINE_DELIMITER_END"

Cached compiler stderr:
 
Fetching value of define "__AVX512CD__" : (undefined) (cached)
Using cached compile:
Cached command line:  cc /tmp/tmpcad4ho3g/testfile.c -E -P -D_FILE_OFFSET_BITS=64 -P -O0 -std=c11 -march=native -mrtm 

Code:
 
        
        #ifndef __AVX512DQ__
        # define __AVX512DQ__ "MESON_GET_DEFINE_UNDEFINED_SENTINEL"
        #endif
        "MESON_GET_DEFINE_DELIMITER_START"
__AVX512DQ__
"MESON_GET_DEFINE_DELIMITER_END"
Cached compiler stdout:
         "MESON_GET_DEFINE_DELIMITER_START"
"MESON_GET_DEFINE_UNDEFINED_SENTINEL"
"MESON_GET_DEFINE_DELIMITER_END"

Cached compiler stderr:
 
Fetching value of define "__AVX512DQ__" : (undefined) (cached)
Using cached compile:
Cached command line:  cc /tmp/tmpddb5t1_k/testfile.c -E -P -D_FILE_OFFSET_BITS=64 -P -O0 -std=c11 -march=native -mrtm 

Code:
 
        
        #ifndef __AVX512F__
        # define __AVX512F__ "MESON_GET_DEFINE_UNDEFINED_SENTINEL"
        #endif
        "MESON_GET_DEFINE_DELIMITER_START"
__AVX512F__
"MESON_GET_DEFINE_DELIMITER_END"
Cached compiler stdout:
         "MESON_GET_DEFINE_DELIMITER_START"
"MESON_GET_DEFINE_UNDEFINED_SENTINEL"
"MESON_GET_DEFINE_DELIMITER_END"

Cached compiler stderr:
 
Fetching value of define "__AVX512F__" : (undefined) (cached)
Using cached compile:
Cached command line:  cc /tmp/tmppc2gpmiy/testfile.c -E -P -D_FILE_OFFSET_BITS=64 -P -O0 -std=c11 -march=native -mrtm 

Code:
 
        
        #ifndef __AVX512VL__
        # define __AVX512VL__ "MESON_GET_DEFINE_UNDEFINED_SENTINEL"
        #endif
        "MESON_GET_DEFINE_DELIMITER_START"
__AVX512VL__
"MESON_GET_DEFINE_DELIMITER_END"
Cached compiler stdout:
         "MESON_GET_DEFINE_DELIMITER_START"
"MESON_GET_DEFINE_UNDEFINED_SENTINEL"
"MESON_GET_DEFINE_DELIMITER_END"

Cached compiler stderr:
 
Fetching value of define "__AVX512VL__" : (undefined) (cached)
Using cached compile:
Cached command line:  cc /tmp/tmp4xxxj8xx/testfile.c -E -P -D_FILE_OFFSET_BITS=64 -P -O0 -std=c11 -march=native -mrtm 

Code:
 
        
        #ifndef __PCLMUL__
        # define __PCLMUL__ "MESON_GET_DEFINE_UNDEFINED_SENTINEL"
        #endif
        "MESON_GET_DEFINE_DELIMITER_START"
__PCLMUL__
"MESON_GET_DEFINE_DELIMITER_END"
Cached compiler stdout:
         "MESON_GET_DEFINE_DELIMITER_START"
1
"MESON_GET_DEFINE_DELIMITER_END"

Cached compiler stderr:
 
Fetching value of define "__PCLMUL__" : 1 (cached)
Using cached compile:
Cached command line:  cc /tmp/tmpkifm9v75/testfile.c -E -P -D_FILE_OFFSET_BITS=64 -P -O0 -std=c11 -march=native -mrtm 

Code:
 
        
        #ifndef __RDRND__
        # define __RDRND__ "MESON_GET_DEFINE_UNDEFINED_SENTINEL"
        #endif
        "MESON_GET_DEFINE_DELIMITER_START"
__RDRND__
"MESON_GET_DEFINE_DELIMITER_END"
Cached compiler stdout:
         "MESON_GET_DEFINE_DELIMITER_START"
1
"MESON_GET_DEFINE_DELIMITER_END"

Cached compiler stderr:
 
Fetching value of define "__RDRND__" : 1 (cached)
Using cached compile:
Cached command line:  cc /tmp/tmpdmp5besb/testfile.c -E -P -D_FILE_OFFSET_BITS=64 -P -O0 -std=c11 -march=native -mrtm 

Code:
 
        
        #ifndef __RDSEED__
        # define __RDSEED__ "MESON_GET_DEFINE_UNDEFINED_SENTINEL"
        #endif
        "MESON_GET_DEFINE_DELIMITER_START"
__RDSEED__
"MESON_GET_DEFINE_DELIMITER_END"
Cached compiler stdout:
         "MESON_GET_DEFINE_DELIMITER_START"
"MESON_GET_DEFINE_UNDEFINED_SENTINEL"
"MESON_GET_DEFINE_DELIMITER_END"

Cached compiler stderr:
 
Fetching value of define "__RDSEED__" : (undefined) (cached)
Using cached compile:
Cached command line:  cc /tmp/tmpa73jn7d_/testfile.c -E -P -D_FILE_OFFSET_BITS=64 -P -O0 -std=c11 -march=native -mrtm 

Code:
 
        
        #ifndef __VPCLMULQDQ__
        # define __VPCLMULQDQ__ "MESON_GET_DEFINE_UNDEFINED_SENTINEL"
        #endif
        "MESON_GET_DEFINE_DELIMITER_START"
__VPCLMULQDQ__
"MESON_GET_DEFINE_DELIMITER_END"
Cached compiler stdout:
         "MESON_GET_DEFINE_DELIMITER_START"
"MESON_GET_DEFINE_UNDEFINED_SENTINEL"
"MESON_GET_DEFINE_DELIMITER_END"

Cached compiler stderr:
 
Fetching value of define "__VPCLMULQDQ__" : (undefined) (cached)
Using cached compile:
Cached command line:  cc /root/dpdk/build/meson-private/tmp2i2lqycs/testfile.c -o /root/dpdk/build/meson-private/tmp2i2lqycs/output.obj -c -D_FILE_OFFSET_BITS=64 -O0 -ffat-lto-objects 

Code:
 extern int i;
int i;

Cached compiler stdout:
 
Cached compiler stderr:
 
Compiler for C supports arguments -ffat-lto-objects: YES (cached)
Running command: /usr/bin/python3 /root/dpdk/buildtools/list-dir-globs.py ''
--- stdout ---

--- stderr ---


Running command: /usr/bin/python3 /root/dpdk/buildtools/list-dir-globs.py ''
--- stdout ---

--- stderr ---


Running command: /usr/bin/python3 /root/dpdk/buildtools/list-dir-globs.py ''
--- stdout ---

--- stderr ---


Message: lib/log: Defining dependency "log"
Message: lib/kvargs: Defining dependency "kvargs"
Message: lib/argparse: Defining dependency "argparse"
Message: lib/telemetry: Defining dependency "telemetry"
Message: lib/pmu: Defining dependency "pmu"
Using cached compile:
Cached command line:  cc /root/dpdk/build/meson-private/tmpm3rwxvi0/testfile.c -o /root/dpdk/build/meson-private/tmpm3rwxvi0/output.exe -D_FILE_OFFSET_BITS=64 -O0 -std=c11 -D_GNU_SOURCE 

Code:
 #include <pthread.h>
#include <limits.h>

        #if defined __stub_pthread_attr_setaffinity_np || defined __stub___pthread_attr_setaffinity_np
        fail fail fail this function is not going to work
        #endif
        
int main(void) {
            void *a = (void*) &pthread_attr_setaffinity_np;
            long long b = (long long) a;
            return (int) b;
        }
Cached compiler stdout:
 
Cached compiler stderr:
 
Checking for function "pthread_attr_setaffinity_np" : YES (cached)
Using cached compile:
Cached command line:  cc /root/dpdk/build/meson-private/tmplkgqgkkh/testfile.c -o /root/dpdk/build/meson-private/tmplkgqgkkh/output.exe -D_FILE_OFFSET_BITS=64 -O0 -std=c11 

Code:
 #include <unistd.h>
#include <limits.h>

        #if defined __stub_getentropy || defined __stub___getentropy
        fail fail fail this function is not going to work
        #endif
        
int main(void) {
            void *a = (void*) &getentropy;
            long long b = (long long) a;
            return (int) b;
        }
Cached compiler stdout:
 
Cached compiler stderr:
 /root/dpdk/build/meson-private/tmplkgqgkkh/testfile.c: In function 'main':
/root/dpdk/build/meson-private/tmplkgqgkkh/testfile.c:9:32: error: 'getentropy' undeclared (first use in this function)
    9 |             void *a = (void*) &getentropy;
      |                                ^~~~~~~~~~
/root/dpdk/build/meson-private/tmplkgqgkkh/testfile.c:9:32: note: each undeclared identifier is reported only once for each function it appears in

Using cached compile:
Cached command line:  cc /root/dpdk/build/meson-private/tmpqubs7ze0/testfile.c -o /root/dpdk/build/meson-private/tmpqubs7ze0/output.exe -D_FILE_OFFSET_BITS=64 -O0 -std=c11 

Code:
 #include <unistd.h>
        int main(void) {

        /* With some toolchains (MSYS2/mingw for example) the compiler
         * provides various builtins which are not really implemented and
         * fall back to the stdlib where they aren't provided and fail at
         * build/link time. In case the user provides a header, including
         * the header didn't lead to the function being defined, and the
         * function we are checking isn't a builtin itself we assume the
         * builtin is not functional and we just error out. */
        #if !0 && !defined(getentropy) && !0
            #error "No definition for __builtin_getentropy found in the prefix"
        #endif

        #ifdef __has_builtin
            #if !__has_builtin(__builtin_getentropy)
                #error "__builtin_getentropy not found"
            #endif
        #elif ! defined(getentropy)
            __builtin_getentropy;
        #endif
        return 0;
        }
Cached compiler stdout:
 
Cached compiler stderr:
 /root/dpdk/build/meson-private/tmpqubs7ze0/testfile.c: In function 'main':
/root/dpdk/build/meson-private/tmpqubs7ze0/testfile.c:12:14: error: #error "No definition for __builtin_getentropy found in the prefix"
   12 |             #error "No definition for __builtin_getentropy found in the prefix"
      |              ^~~~~
/root/dpdk/build/meson-private/tmpqubs7ze0/testfile.c:17:18: error: #error "__builtin_getentropy not found"
   17 |                 #error "__builtin_getentropy not found"
      |                  ^~~~~

Checking for function "getentropy" : NO (cached)
Message: lib/eal: Defining dependency "eal"
Message: lib/ptr_compress: Defining dependency "ptr_compress"
Message: lib/ring: Defining dependency "ring"
Message: lib/rcu: Defining dependency "rcu"
Message: lib/mempool: Defining dependency "mempool"
Message: lib/mbuf: Defining dependency "mbuf"
Using cached compile:
Cached command line:  cc /root/dpdk/build/meson-private/tmpfok579ix/testfile.c -o /root/dpdk/build/meson-private/tmpfok579ix/output.obj -c -D_FILE_OFFSET_BITS=64 -O0 -mpclmul 

Code:
 extern int i;
int i;

Cached compiler stdout:
 
Cached compiler stderr:
 
Compiler for C supports arguments -mpclmul: YES (cached)
Using cached compile:
Cached command line:  cc /root/dpdk/build/meson-private/tmp0xo1j_tf/testfile.c -o /root/dpdk/build/meson-private/tmp0xo1j_tf/output.obj -c -D_FILE_OFFSET_BITS=64 -O0 -maes 

Code:
 extern int i;
int i;

Cached compiler stdout:
 
Cached compiler stderr:
 
Compiler for C supports arguments -maes: YES (cached)
Using cached compile:
Cached command line:  cc /root/dpdk/build/meson-private/tmpqej3e19q/testfile.c -o /root/dpdk/build/meson-private/tmpqej3e19q/output.obj -c -D_FILE_OFFSET_BITS=64 -O0 -mvpclmulqdq 

Code:
 extern int i;
int i;

Cached compiler stdout:
 
Cached compiler stderr:
 
Compiler for C supports arguments -mvpclmulqdq: YES (cached)
Message: lib/net: Defining dependency "net"
Message: lib/meter: Defining dependency "meter"
Message: lib/ethdev: Defining dependency "ethdev"
Message: lib/pci: Defining dependency "pci"
Message: lib/cmdline: Defining dependency "cmdline"
Message: lib/metrics: Defining dependency "metrics"
Message: lib/hash: Defining dependency "hash"
Message: lib/timer: Defining dependency "timer"
Message: lib/acl: Defining dependency "acl"
Message: lib/bbdev: Defining dependency "bbdev"
Message: lib/bitratestats: Defining dependency "bitratestats"
Dependency libelf found: YES 0.192 (cached)
Message: lib/bpf: Defining dependency "bpf"
Message: lib/cfgfile: Defining dependency "cfgfile"
Message: lib/compressdev: Defining dependency "compressdev"
Message: lib/cryptodev: Defining dependency "cryptodev"
Message: lib/distributor: Defining dependency "distributor"
Message: lib/dmadev: Defining dependency "dmadev"
Message: lib/efd: Defining dependency "efd"
Message: lib/eventdev: Defining dependency "eventdev"
Message: lib/dispatcher: Defining dependency "dispatcher"
Message: lib/gpudev: Defining dependency "gpudev"
Message: lib/gro: Defining dependency "gro"
Message: lib/gso: Defining dependency "gso"
Message: lib/ip_frag: Defining dependency "ip_frag"
Message: lib/jobstats: Defining dependency "jobstats"
Message: lib/latencystats: Defining dependency "latencystats"
Message: lib/lpm: Defining dependency "lpm"
Using cached compile:
Cached command line:  cc /root/dpdk/build/meson-private/tmpx05q8g3p/testfile.c -o /root/dpdk/build/meson-private/tmpx05q8g3p/output.obj -c -D_FILE_OFFSET_BITS=64 -O0 -mavx512ifma 

Code:
 extern int i;
int i;

Cached compiler stdout:
 
Cached compiler stderr:
 
Compiler for C supports arguments -mavx512ifma: YES (cached)
Message: lib/member: Defining dependency "member"
Message: lib/pcapng: Defining dependency "pcapng"
Message: lib/power: Defining dependency "power"
Message: lib/rawdev: Defining dependency "rawdev"
Message: lib/regexdev: Defining dependency "regexdev"
Message: lib/mldev: Defining dependency "mldev"
Message: lib/rib: Defining dependency "rib"
Message: lib/reorder: Defining dependency "reorder"
Message: lib/sched: Defining dependency "sched"
Message: lib/security: Defining dependency "security"
Message: lib/stack: Defining dependency "stack"
Using cached compile:
Cached command line:  cc /root/dpdk/build/meson-private/tmpgvilfmez/testfile.c -E -P -D_FILE_OFFSET_BITS=64 -P -O0 -std=c11 

Code:
 
        #ifdef __has_include
         #if !__has_include("linux/userfaultfd.h")
          #error "Header 'linux/userfaultfd.h' could not be found"
         #endif
        #else
         #include <linux/userfaultfd.h>
        #endif
Cached compiler stdout:
 
Cached compiler stderr:
 
Has header "linux/userfaultfd.h" : YES (cached)
Using cached compile:
Cached command line:  cc /root/dpdk/build/meson-private/tmpzzftqek_/testfile.c -o /root/dpdk/build/meson-private/tmpzzftqek_/output.obj -c -D_FILE_OFFSET_BITS=64 -O0 -fno-strict-aliasing 

Code:
 extern int i;
int i;

Cached compiler stdout:
 
Cached compiler stderr:
 
Compiler for C supports arguments -fno-strict-aliasing: YES (cached)
Using cached compile:
Cached command line:  cc /root/dpdk/build/meson-private/tmp5071zho9/testfile.c -o /root/dpdk/build/meson-private/tmp5071zho9/output.obj -c -D_FILE_OFFSET_BITS=64 -O0 -Waddress-of-packed-member -Wno-address-of-packed-member 

Code:
 extern int i;
int i;

Cached compiler stdout:
 
Cached compiler stderr:
 
Compiler for C supports arguments -Wno-address-of-packed-member: YES (cached)
Message: lib/vhost: Defining dependency "vhost"
Message: lib/ipsec: Defining dependency "ipsec"
Message: lib/pdcp: Defining dependency "pdcp"
Message: lib/fib: Defining dependency "fib"
Message: lib/port: Defining dependency "port"
Message: lib/pdump: Defining dependency "pdump"
Message: lib/table: Defining dependency "table"
Message: lib/pipeline: Defining dependency "pipeline"
Message: lib/graph: Defining dependency "graph"
Message: lib/node: Defining dependency "node"
Running command: /usr/bin/python3 /root/dpdk/buildtools/list-dir-globs.py ''
--- stdout ---

--- stderr ---


Running command: /usr/bin/python3 /root/dpdk/buildtools/list-dir-globs.py ,bus/pci,bus/vdev,bus/auxiliary,net/intel/i40e,net/intel/iavf
--- stdout ---
bus/pci
bus/vdev
bus/auxiliary
net/intel/i40e
net/intel/iavf

--- stderr ---


Using cached compile:
Cached command line:  cc /root/dpdk/build/meson-private/tmp4_g0hfw2/testfile.c -o /root/dpdk/build/meson-private/tmp4_g0hfw2/output.obj -c -D_FILE_OFFSET_BITS=64 -O0 -Wformat-truncation -Wno-format-truncation 

Code:
 extern int i;
int i;

Cached compiler stdout:
 
Cached compiler stderr:
 
Compiler for C supports arguments -Wno-format-truncation: YES (cached)
Using cached compile:
Cached command line:  cc /root/dpdk/build/meson-private/tmp5071zho9/testfile.c -o /root/dpdk/build/meson-private/tmp5071zho9/output.obj -c -D_FILE_OFFSET_BITS=64 -O0 -Waddress-of-packed-member -Wno-address-of-packed-member 

Code:
 extern int i;
int i;

Cached compiler stdout:
 
Cached compiler stderr:
 
Compiler for C supports arguments -Wno-address-of-packed-member: YES (cached)
Message: drivers/bus/auxiliary: Defining dependency "bus_auxiliary"
Message: drivers/bus/pci: Defining dependency "bus_pci"
Message: drivers/bus/vdev: Defining dependency "bus_vdev"
Message: drivers/mempool/ring: Defining dependency "mempool_ring"
Message: drivers/net/intel/i40e: Defining dependency "net_i40e"
Message: drivers/net/intel/iavf: Defining dependency "net_iavf"
Running command: /usr/bin/python3 /root/dpdk/buildtools/list-dir-globs.py ',*'
--- stdout ---
pdump
test-crypto-perf
test-gpudev
test-pipeline
test-sad
test
test-mldev
test-dma-perf
test-bbdev
test-pmd
test-flow-perf
test-cmdline
proc-info
test-acl
dumpcap
test-regex
test-security-perf
graph
test-fib
test-eventdev
test-compress-perf

--- stderr ---


Running command: /usr/bin/python3 /root/dpdk/buildtools/list-dir-globs.py ,
--- stdout ---

--- stderr ---


Running command: /usr/bin/python3 /root/dpdk/buildtools/list-dir-globs.py '*'
--- stdout ---
pdump
test-crypto-perf
test-gpudev
test-pipeline
test-sad
test
test-mldev
test-dma-perf
test-bbdev
test-pmd
test-flow-perf
test-cmdline
proc-info
test-acl
dumpcap
test-regex
test-security-perf
graph
test-fib
test-eventdev
test-compress-perf

--- stderr ---


Program doxygen found: NO
Program sphinx-build found: NO
Configuring rte_build_config.h using configuration
Running command: /usr/bin/python3 /root/dpdk/buildtools/pkg-config/set-static-linker-flags.py
--- stdout ---
Processing /root/dpdk/build/meson-private/libdpdk-libs.pc
Processing /root/dpdk/build/meson-private/libdpdk.pc
Processing /root/dpdk/build/meson-uninstalled/libdpdk-uninstalled.pc
Processing /root/dpdk/build/meson-uninstalled/libdpdk-libs-uninstalled.pc

--- stderr ---


Message: 
=================
Applications Enabled
=================

apps:
	

Message: 
=================
Libraries Enabled
=================

libs:
	log, kvargs, argparse, telemetry, pmu, eal, ptr_compress, ring, 
	rcu, mempool, mbuf, net, meter, ethdev, pci, cmdline, 
	metrics, hash, timer, acl, bbdev, bitratestats, bpf, cfgfile, 
	compressdev, cryptodev, distributor, dmadev, efd, eventdev, dispatcher, gpudev, 
	gro, gso, ip_frag, jobstats, latencystats, lpm, member, pcapng, 
	power, rawdev, regexdev, mldev, rib, reorder, sched, security, 
	stack, vhost, ipsec, pdcp, fib, port, pdump, table, 
	pipeline, graph, node, 

Message: 
===============
Drivers Enabled
===============

common:
	
bus:
	auxiliary, pci, vdev, 
mempool:
	ring, 
dma:
	
net:
	i40e, iavf, 
raw:
	
crypto:
	
compress:
	
regex:
	
ml:
	
vdpa:
	
event:
	
baseband:
	
gpu:
	
power:
	

Message: 
=================
Content Skipped
=================

apps:
	dumpcap:	explicitly disabled via build config
	graph:	explicitly disabled via build config
	pdump:	explicitly disabled via build config
	proc-info:	explicitly disabled via build config
	test-acl:	explicitly disabled via build config
	test-bbdev:	explicitly disabled via build config
	test-cmdline:	explicitly disabled via build config
	test-compress-perf:	explicitly disabled via build config
	test-crypto-perf:	explicitly disabled via build config
	test-dma-perf:	explicitly disabled via build config
	test-eventdev:	explicitly disabled via build config
	test-fib:	explicitly disabled via build config
	test-flow-perf:	explicitly disabled via build config
	test-gpudev:	explicitly disabled via build config
	test-mldev:	explicitly disabled via build config
	test-pipeline:	explicitly disabled via build config
	test-pmd:	explicitly disabled via build config
	test-regex:	explicitly disabled via build config
	test-sad:	explicitly disabled via build config
	test-security-perf:	explicitly disabled via build config
	test:	explicitly disabled via build config
	
libs:
	
drivers:
	common/cpt:	not in enabled drivers build config
	common/dpaax:	not in enabled drivers build config
	common/ionic:	not in enabled drivers build config
	common/mvep:	not in enabled drivers build config
	common/octeontx:	not in enabled drivers build config
	bus/cdx:	not in enabled drivers build config
	bus/dpaa:	not in enabled drivers build config
	bus/fslmc:	not in enabled drivers build config
	bus/ifpga:	not in enabled drivers build config
	bus/platform:	not in enabled drivers build config
	bus/uacce:	not in enabled drivers build config
	bus/vmbus:	not in enabled drivers build config
	common/cnxk:	not in enabled drivers build config
	common/mlx5:	not in enabled drivers build config
	common/nfp:	not in enabled drivers build config
	common/nitrox:	not in enabled drivers build config
	common/qat:	not in enabled drivers build config
	common/sfc_efx:	not in enabled drivers build config
	common/sxe2:	not in enabled drivers build config
	common/zsda:	not in enabled drivers build config
	mempool/bucket:	not in enabled drivers build config
	mempool/cnxk:	not in enabled drivers build config
	mempool/dpaa:	not in enabled drivers build config
	mempool/dpaa2:	not in enabled drivers build config
	mempool/octeontx:	not in enabled drivers build config
	mempool/stack:	not in enabled drivers build config
	dma/cnxk:	not in enabled drivers build config
	dma/dpaa:	not in enabled drivers build config
	dma/dpaa2:	not in enabled drivers build config
	dma/hisi_acc:	not in enabled drivers build config
	dma/hisi_pciep:	not in enabled drivers build config
	dma/idxd:	not in enabled drivers build config
	dma/ioat:	not in enabled drivers build config
	dma/odm:	not in enabled drivers build config
	dma/skeleton:	not in enabled drivers build config
	net/af_packet:	not in enabled drivers build config
	net/af_xdp:	not in enabled drivers build config
	net/ark:	not in enabled drivers build config
	net/atlantic:	not in enabled drivers build config
	net/avp:	not in enabled drivers build config
	net/axgbe:	not in enabled drivers build config
	net/bnx2x:	not in enabled drivers build config
	net/bnxt:	not in enabled drivers build config
	net/bonding:	not in enabled drivers build config
	net/cnxk:	not in enabled drivers build config
	net/cxgbe:	not in enabled drivers build config
	net/dpaa:	not in enabled drivers build config
	net/dpaa2:	not in enabled drivers build config
	net/ena:	not in enabled drivers build config
	net/enetc:	not in enabled drivers build config
	net/enetfec:	not in enabled drivers build config
	net/enic:	not in enabled drivers build config
	net/failsafe:	not in enabled drivers build config
	net/gve:	not in enabled drivers build config
	net/hinic:	not in enabled drivers build config
	net/hinic3:	not in enabled drivers build config
	net/hns3:	not in enabled drivers build config
	net/intel/e1000:	not in enabled drivers build config
	net/intel/fm10k:	not in enabled drivers build config
	net/intel/ice:	not in enabled drivers build config
	net/intel/idpf:	not in enabled drivers build config
	net/intel/ipn3ke:	not in enabled drivers build config
	net/intel/ixgbe:	not in enabled drivers build config
	net/intel/cpfl:	not in enabled drivers build config
	net/ionic:	not in enabled drivers build config
	net/mana:	not in enabled drivers build config
	net/memif:	not in enabled drivers build config
	net/mlx4:	not in enabled drivers build config
	net/mlx5:	not in enabled drivers build config
	net/mvneta:	not in enabled drivers build config
	net/mvpp2:	not in enabled drivers build config
	net/nbl:	not in enabled drivers build config
	net/netvsc:	not in enabled drivers build config
	net/nfb:	not in enabled drivers build config
	net/nfp:	not in enabled drivers build config
	net/ngbe:	not in enabled drivers build config
	net/ntnic:	not in enabled drivers build config
	net/null:	not in enabled drivers build config
	net/octeontx:	not in enabled drivers build config
	net/octeon_ep:	not in enabled drivers build config
	net/pcap:	not in enabled drivers build config
	net/pfe:	not in enabled drivers build config
	net/qede:	not in enabled drivers build config
	net/r8169:	not in enabled drivers build config
	net/ring:	not in enabled drivers build config
	net/rnp:	not in enabled drivers build config
	net/sfc:	not in enabled drivers build config
	net/softnic:	not in enabled drivers build config
	net/sxe2:	not in enabled drivers build config
	net/tap:	not in enabled drivers build config
	net/thunderx:	not in enabled drivers build config
	net/txgbe:	not in enabled drivers build config
	net/vdev_netvsc:	not in enabled drivers build config
	net/vhost:	not in enabled drivers build config
	net/virtio:	not in enabled drivers build config
	net/vmxnet3:	not in enabled drivers build config
	net/xsc:	not in enabled drivers build config
	net/zxdh:	not in enabled drivers build config
	raw/cnxk_bphy:	not in enabled drivers build config
	raw/cnxk_gpio:	not in enabled drivers build config
	raw/cnxk_rvu_lf:	not in enabled drivers build config
	raw/dpaa2_cmdif:	not in enabled drivers build config
	raw/gdtc:	not in enabled drivers build config
	raw/ifpga:	not in enabled drivers build config
	raw/ntb:	not in enabled drivers build config
	raw/skeleton:	not in enabled drivers build config
	crypto/armv8:	not in enabled drivers build config
	crypto/bcmfs:	not in enabled drivers build config
	crypto/caam_jr:	not in enabled drivers build config
	crypto/ccp:	not in enabled drivers build config
	crypto/cnxk:	not in enabled drivers build config
	crypto/dpaa_sec:	not in enabled drivers build config
	crypto/dpaa2_sec:	not in enabled drivers build config
	crypto/ionic:	not in enabled drivers build config
	crypto/ipsec_mb:	not in enabled drivers build config
	crypto/mlx5:	not in enabled drivers build config
	crypto/mvsam:	not in enabled drivers build config
	crypto/nitrox:	not in enabled drivers build config
	crypto/null:	not in enabled drivers build config
	crypto/octeontx:	not in enabled drivers build config
	crypto/openssl:	not in enabled drivers build config
	crypto/scheduler:	not in enabled drivers build config
	crypto/uadk:	not in enabled drivers build config
	crypto/virtio:	not in enabled drivers build config
	compress/isal:	not in enabled drivers build config
	compress/mlx5:	not in enabled drivers build config
	compress/nitrox:	not in enabled drivers build config
	compress/octeontx:	not in enabled drivers build config
	compress/uadk:	not in enabled drivers build config
	compress/zlib:	not in enabled drivers build config
	regex/mlx5:	not in enabled drivers build config
	regex/cn9k:	not in enabled drivers build config
	ml/cnxk:	not in enabled drivers build config
	vdpa/ifc:	not in enabled drivers build config
	vdpa/mlx5:	not in enabled drivers build config
	vdpa/nfp:	not in enabled drivers build config
	vdpa/sfc:	not in enabled drivers build config
	event/cnxk:	not in enabled drivers build config
	event/dlb2:	not in enabled drivers build config
	event/dpaa:	not in enabled drivers build config
	event/dpaa2:	not in enabled drivers build config
	event/dsw:	not in enabled drivers build config
	event/octeontx:	not in enabled drivers build config
	event/opdl:	not in enabled drivers build config
	event/skeleton:	not in enabled drivers build config
	event/sw:	not in enabled drivers build config
	baseband/acc:	not in enabled drivers build config
	baseband/fpga_5gnr_fec:	not in enabled drivers build config
	baseband/fpga_lte_fec:	not in enabled drivers build config
	baseband/la12xx:	not in enabled drivers build config
	baseband/null:	not in enabled drivers build config
	baseband/turbo_sw:	not in enabled drivers build config
	gpu/cuda:	not in enabled drivers build config
	power/acpi:	not in enabled drivers build config
	power/amd_pstate:	not in enabled drivers build config
	power/amd_uncore:	not in enabled drivers build config
	power/cppc:	not in enabled drivers build config
	power/intel_pstate:	not in enabled drivers build config
	power/intel_uncore:	not in enabled drivers build config
	power/kvm_vm:	not in enabled drivers build config
	

Message: DPDK build config complete:
  source path = "/root/dpdk"
  build path  = "/root/dpdk/build"
Build targets in project: 278

DPDK 26.07.0

  User defined options
    b_lto         : true
    buildtype     : release
    debug         : true
    disable_apps  : *
    enable_drivers: bus/pci,bus/vdev,bus/auxiliary,net/i40e,net/intel/iavf
    examples      : 
    max_numa_nodes: 1
    platform      : native

Found ninja-1.12.1 at /usr/bin/ninja
Failed to guess install tag for install script: /bin/sh /root/dpdk/config/../buildtools/symlink-drivers-solibs.sh lib/x86_64-linux-gnu dpdk/pmds-26.2
Failed to guess install tag for /usr/local/share/dpdk/dummy
Failed to guess install tag for /usr/local/share/dpdk/dummy
Failed to guess install tag for install script: /bin/sh /root/dpdk/config/../buildtools/symlink-drivers-solibs.sh lib/x86_64-linux-gnu dpdk/pmds-26.2
Failed to guess install tag for /usr/local/share/dpdk/dummy
Failed to guess install tag for /usr/local/share/dpdk/dummy
